BDBM347123 2-(4-((4-isopropylphenyl) (piperidin-3-yl)amino)phenoxy) pyrido[3,4-d]pyrimidin-4-ol::US10202381, Example 130::US10208039, Example 130
SMILES CC(C)c1ccc(cc1)N(C1CCCNC1)c1ccc(Oc2nc(O)c3ccncc3n2)cc1
InChI Key InChIKey=OTAMOTHWTAFGQO-UHFFFAOYSA-N
Data  1 IC50
  Tab Delimited (TSV)   2D SDfile   Computed 3D by Vconf -m prep SDfile
Find this compound or compounds like it in BindingDB:
Activity Spreadsheet -- Enzyme Inhibition Constant Data from BindingDB
Found 1 hit for monomerid = 347123
TargetLysine-specific demethylase 4C(Homo sapiens (Human))
Celgene Quanticel Research
US Patent
LigandPNGBDBM347123(2-(4-((4-isopropylphenyl) (piperidin-3-yl)amino)ph...)
Affinity DataIC50: <100nM. Assay description: The ability of test compounds to inhibit the activity of JMJD2C was determined in 384-well plate-format under the following reaction conditions: 0.3 ...
Ligand InfoPC cidPC sid
In DepthDetails US Patent