BDBM347142 2-(3-methyl-4-(methyl(4- propylphenyl)amino)phenoxy) pyrido[3,4-d]pyrimidin-4-ol::US10202381, Example 149::US10208039, Example 149
SMILES CCCc1ccc(cc1)N(C)c1ccc(Oc2nc(O)c3ccncc3n2)cc1C
InChI Key InChIKey=BVIMLIOCGWAVLZ-UHFFFAOYSA-N
Data  1 IC50
  Tab Delimited (TSV)   2D SDfile   Computed 3D by Vconf -m prep SDfile
Find this compound or compounds like it in BindingDB:
Activity Spreadsheet -- Enzyme Inhibition Constant Data from BindingDB
Found 1 hit for monomerid = 347142
TargetLysine-specific demethylase 4C(Homo sapiens (Human))
Celgene Quanticel Research
US Patent
LigandPNGBDBM347142(2-(3-methyl-4-(methyl(4- propylphenyl)amino)phenox...)
Affinity DataIC50:  550nM. Assay description: The ability of test compounds to inhibit the activity of JMJD2C was determined in 384-well plate-format under the following reaction conditions: 0.3 ...
Ligand InfoPC cidPC sid
In DepthDetails US Patent