BDBM347205 US10202404, Compound A-78
SMILES C[C@H]1N2[C@H](Cn3cc(-c4nnc(Cc5ccc(F)cc5F)s4)c(=O)c(O)c3C2=O)OCC1(F)F
InChI Key InChIKey=ISJRRYATASDRPU-PSLIRLAXSA-N
Data  1 EC50
  Tab Delimited (TSV)   2D SDfile   Computed 3D by Vconf -m prep SDfile
Find this compound or compounds like it in BindingDB:
Activity Spreadsheet -- Enzyme Inhibition Constant Data from BindingDB
Found 1 hit for monomerid = 347205
TargetGag-Pol polyprotein(Human immunodeficiency virus type 1 group M subtyp...)
Shionogi
US Patent
LigandPNGBDBM347205(US10202404, Compound A-78)
Affinity DataEC50:  4.60nM. Assay description: Previously, a series of two-fold dilution on test samples were carried out in a 96-well plate (50 μL/well). Two plates were made for measuring a...
Ligand InfoPC cidPC sid
In DepthDetails US Patent