BDBM347209 US10202404, Compound B-2
SMILES Oc1c2C(=O)N3CCCC[C@@H]3Cn2cc(-c2nnc(Cc3ccc(F)cc3F)s2)c1=O
InChI Key InChIKey=QRTOQWZHPQVKJQ-CYBMUJFWSA-N
Data  1 EC50
  Tab Delimited (TSV)   2D SDfile   Computed 3D by Vconf -m prep SDfile
Find this compound or compounds like it in BindingDB:
Activity Spreadsheet -- Enzyme Inhibition Constant Data from BindingDB
Found 1 hit for monomerid = 347209
TargetGag-Pol polyprotein(Human immunodeficiency virus type 1 group M subtyp...)
Shionogi
US Patent
LigandPNGBDBM347209(US10202404, Compound B-2)
Affinity DataEC50:  3.90nM. Assay description: Previously, a series of two-fold dilution on test samples were carried out in a 96-well plate (50 μL/well). Two plates were made for measuring a...
Ligand InfoPC cidPC sid
In DepthDetails US Patent