BDBM347269 US10202411, Compound 334
SMILES OC[C@H]1C[C@@H](O[C@@H]1COP([O-])(=O)OP([O-])(=O)OP(O)([O-])=O)n1ccc(=O)[nH]c1=O
InChI Key
Data  1 IC50
  Tab Delimited (TSV)   2D SDfile   Computed 3D by Vconf -m prep SDfile
Find this compound or compounds like it in BindingDB:
Activity Spreadsheet -- Enzyme Inhibition Constant Data from BindingDB
Found 1 hit for monomerid = 347269
TargetGenome polyprotein(Hepatitis C Virus (Virus))
Idenix Pharmaceuticals
US Patent
LigandPNGBDBM347269(US10202411, Compound 334)
Affinity DataIC50: >1.00E+4nM. Assay description: Test compounds in the form of nucleoside triphosphates were examined for inhibitory activity against purified HCV polymerase in a standard assay. Bac...
Ligand InfoKEGGPC cidPC sid
In DepthDetails US Patent