BDBM34731 1-(3-nitrophenyl)-3-phenylazanyl-propan-1-one::3-anilino-1-(3-nitrophenyl)-1-propanone::3-anilino-1-(3-nitrophenyl)propan-1-one::CHEMBL233347::MLS000571277::SMR000193644::cid_877450
SMILES [O-][N+](=O)c1cccc(c1)C(=O)CCNc1ccccc1
InChI Key InChIKey=HZWOIIAHZHTTNX-UHFFFAOYSA-N
Data  3 IC50
  Tab Delimited (TSV)   2D SDfile   Computed 3D by Vconf -m prep SDfile
Find this compound or compounds like it in BindingDB:
Activity Spreadsheet -- Enzyme Inhibition Constant Data from BindingDB
Found 3 hits for monomerid = 34731
TargetMannose-6-phosphate isomerase(Homo sapiens (Human))
Burnham Center For Chemical Genomics
Curated by PubChem BioAssay
LigandPNGBDBM34731(1-(3-nitrophenyl)-3-phenylazanyl-propan-1-one | 3-...)
Affinity DataIC50:  3.95E+4nMpH: 7.4 T: 2°C. Assay description: The purpose of this assay is to identify non-competititve inhibitors of human PMI. This is accomplished by using a G6PD- NADPH-coupled assay. In the ...
In DepthDetails PCBioAssay
TargetGlutathione reductase, mitochondrial(Homo sapiens (Human))
Harvard Medical School
Curated by ChEMBL
LigandPNGBDBM34731(1-(3-nitrophenyl)-3-phenylazanyl-propan-1-one | 3-...)
Affinity DataIC50:  5.80E+4nM. Assay description: Inhibition of human GR
In DepthDetails ArticlePubMed
TargetTrypanothione reductase(Trypanosoma brucei brucei)
Harvard Medical School
Curated by ChEMBL
LigandPNGBDBM34731(1-(3-nitrophenyl)-3-phenylazanyl-propan-1-one | 3-...)
Affinity DataIC50:  1.70E+3nM. Assay description: Inhibition of TR by DTNB-coupled assay
In DepthDetails ArticlePubMed