BDBM347329 N-(4-((Dimethylamino)methyl)-3-(trifluoromethyl)phenyl)-2-(4-(5-ethoxy-6-oxo-1,6-dihydropyridin-3-yl)-2-fluorophenyl)acetamide hydrochloride::US9789100, Example 17
SMILES CCOc1cc(c[nH]c1=O)-c1ccc(CC(=O)Nc2ccc(CN(C)C)c(c2)C(F)(F)F)c(F)c1
InChI Key InChIKey=AYZZXXYXCZSMJA-UHFFFAOYSA-N
Data  3 IC50
  Tab Delimited (TSV)   2D SDfile   Computed 3D by Vconf -m prep SDfile
Find this compound or compounds like it in BindingDB:
Activity Spreadsheet -- Enzyme Inhibition Constant Data from BindingDB
Found 3 hits for monomerid = 347329
TargetProto-oncogene tyrosine-protein kinase receptor Ret [658-1114](Homo sapiens (Human))
Glaxosmithkline
US Patent
LigandPNGBDBM347329(N-(4-((Dimethylamino)methyl)-3-(trifluoromethyl)ph...)
Affinity DataIC50: <100nM. Assay description: Human RET kinase cytoplasmic domain (amino acids 658-1114 of accession number NP_000314.1) was expressed as an N-terminal GST-fusion protein using a ...
Ligand InfoPC cidPC sid
In DepthDetails US Patent
TargetProto-oncogene tyrosine-protein kinase receptor Ret [658-1114](Homo sapiens (Human))
Glaxosmithkline
US Patent
LigandPNGBDBM347329(N-(4-((Dimethylamino)methyl)-3-(trifluoromethyl)ph...)
Affinity DataIC50:  300nM. Assay description: Human RET kinase cytoplasmic domain (amino acids 658-1114 of accession number NP_000314.1) was expressed as an N-terminal GST-fusion protein using a ...
Ligand InfoPC cidPC sid
In DepthDetails US Patent
TargetProto-oncogene tyrosine-protein kinase receptor Ret [658-1114](Homo sapiens (Human))
Glaxosmithkline
US Patent
LigandPNGBDBM347329(N-(4-((Dimethylamino)methyl)-3-(trifluoromethyl)ph...)
Affinity DataIC50:  300nM. Assay description: Human RET kinase cytoplasmic domain (amino acids 658-1114 of accession number NP_000314.1) was expressed as an N-terminal GST-fusion protein using a ...
Ligand InfoPC cidPC sid
In DepthDetails US Patent