BDBM347339 2-(4-(4-Ethoxy-6-oxo-1,6-dihydropyridin-3-yl)-2-fluorophenyl)-N-(3-(1,1,1-trifluoro-2-methylpropan-2-yl)isoxazol-5-yl)acetamide::US9789100, Example 27::US9789100, Example 40
SMILES CCOc1cc(=O)[nH]cc1-c1ccc(CC(=O)Nc2cc(no2)C(C)(C)C(F)(F)F)c(F)c1
InChI Key InChIKey=DYLOIFYWXMEMOK-UHFFFAOYSA-N
Data  9 IC50
  Tab Delimited (TSV)   2D SDfile   Computed 3D by Vconf -m prep SDfile
Find this compound or compounds like it in BindingDB:
Activity Spreadsheet -- Enzyme Inhibition Constant Data from BindingDB
Found 9 hits for monomerid = 347339
TargetProto-oncogene tyrosine-protein kinase receptor Ret [658-1114](Homo sapiens (Human))
Glaxosmithkline
US Patent
LigandPNGBDBM347339(2-(4-(4-Ethoxy-6-oxo-1,6-dihydropyridin-3-yl)-2-fl...)
Affinity DataIC50: <100nM. Assay description: Human RET kinase cytoplasmic domain (amino acids 658-1114 of accession number NP_000314.1) was expressed as an N-terminal GST-fusion protein using a ...
Ligand InfoPC cidPC sid
In DepthDetails US Patent
TargetProto-oncogene tyrosine-protein kinase receptor Ret [658-1114](Homo sapiens (Human))
Glaxosmithkline
US Patent
LigandPNGBDBM347339(2-(4-(4-Ethoxy-6-oxo-1,6-dihydropyridin-3-yl)-2-fl...)
Affinity DataIC50: <100nM. Assay description: Human RET kinase cytoplasmic domain (amino acids 658-1114 of accession number NP_000314.1) was expressed as an N-terminal GST-fusion protein using a ...
Ligand InfoPC cidPC sid
In DepthDetails US Patent
TargetProto-oncogene tyrosine-protein kinase receptor Ret [658-1114](Homo sapiens (Human))
Glaxosmithkline
US Patent
LigandPNGBDBM347339(2-(4-(4-Ethoxy-6-oxo-1,6-dihydropyridin-3-yl)-2-fl...)
Affinity DataIC50: <100nM. Assay description: Human RET kinase cytoplasmic domain (amino acids 658-1114 of accession number NP_000314.1) was expressed as an N-terminal GST-fusion protein using a ...
Ligand InfoPC cidPC sid
In DepthDetails US Patent
TargetProto-oncogene tyrosine-protein kinase receptor Ret [658-1114](Homo sapiens (Human))
Glaxosmithkline
US Patent
LigandPNGBDBM347339(2-(4-(4-Ethoxy-6-oxo-1,6-dihydropyridin-3-yl)-2-fl...)
Affinity DataIC50: <100nM. Assay description: Human RET kinase cytoplasmic domain (amino acids 658-1114 of accession number NP_000314.1) was expressed as an N-terminal GST-fusion protein using a ...
Ligand InfoPC cidPC sid
In DepthDetails US Patent
TargetProto-oncogene tyrosine-protein kinase receptor Ret(Homo sapiens (Human))
Glaxosmithkline
Curated by ChEMBL
LigandPNGBDBM347339(2-(4-(4-Ethoxy-6-oxo-1,6-dihydropyridin-3-yl)-2-fl...)
Affinity DataIC50:  3.40nM. Assay description: Inhibition of RET phosphorylation in human TT cells after 2 hrs by ELISA
Ligand InfoPC cidPC sid
In DepthDetails ArticlePubMed
TargetProto-oncogene tyrosine-protein kinase receptor Ret [658-1114](Homo sapiens (Human))
Glaxosmithkline
US Patent
LigandPNGBDBM347339(2-(4-(4-Ethoxy-6-oxo-1,6-dihydropyridin-3-yl)-2-fl...)
Affinity DataIC50: <100nM. Assay description: Human RET kinase cytoplasmic domain (amino acids 658-1114 of accession number NP_000314.1) was expressed as an N-terminal GST-fusion protein using a ...
Ligand InfoPC cidPC sid
In DepthDetails US Patent
TargetVascular endothelial growth factor receptor 2(Homo sapiens (Human))
Glaxosmithkline
Curated by ChEMBL
LigandPNGBDBM347339(2-(4-(4-Ethoxy-6-oxo-1,6-dihydropyridin-3-yl)-2-fl...)
Affinity DataIC50:  40nM. Assay description: Inhibition of human KDR using cisbio TK biotin-peptide as substrate preincubated for 30 mins followed by substrate addition measured after 30 mins by...
Ligand InfoPC cidPC sid
In DepthDetails ArticlePubMed
TargetProto-oncogene tyrosine-protein kinase receptor Ret(Homo sapiens (Human))
Glaxosmithkline
Curated by ChEMBL
LigandPNGBDBM347339(2-(4-(4-Ethoxy-6-oxo-1,6-dihydropyridin-3-yl)-2-fl...)
Affinity DataIC50:  0.400nM. Assay description: Inhibition of human RET using cisbio TK biotin-peptide as substrate preincubated for 30 mins followed by substrate addition measured after 1 hr by HT...
Ligand InfoPC cidPC sid
In DepthDetails ArticlePubMed
TargetProto-oncogene tyrosine-protein kinase receptor Ret [658-1114](Homo sapiens (Human))
Glaxosmithkline
US Patent
LigandPNGBDBM347339(2-(4-(4-Ethoxy-6-oxo-1,6-dihydropyridin-3-yl)-2-fl...)
Affinity DataIC50: <100nM. Assay description: Human RET kinase cytoplasmic domain (amino acids 658-1114 of accession number NP_000314.1) was expressed as an N-terminal GST-fusion protein using a ...
Ligand InfoPC cidPC sid
In DepthDetails US Patent