BDBM347374 US10301320, ID SW208078::US10869871, ID # SW208078::US20230285402, ID # SW208078::US9789116, SW208078
SMILES CCCCS(=O)(=O)c1sc2nc(cc(-c3ccccc3)c2c1N)-c1cccs1
InChI Key InChIKey=KJRNVQHBVKSHPJ-UHFFFAOYSA-N
Data  6 IC50
  Tab Delimited (TSV)   2D SDfile   Computed 3D by Vconf -m prep SDfile
Find this compound or compounds like it in BindingDB:
Activity Spreadsheet -- Enzyme Inhibition Constant Data from BindingDB
Found 4 hits for monomerid = 347374
Target15-hydroxyprostaglandin dehydrogenase [NAD(+)](Homo sapiens (Human))
Case Western Reserve University
US Patent
LigandPNGBDBM347374(US10301320, ID SW208078 | US10869871, ID # SW20807...)
Affinity DataIC50:  25.4nM. Assay description: Each compound for inhibiting enzymatic activity of recombinant 15-PGDH in an in vitro assay.
In DepthDetails US Patent
Target15-hydroxyprostaglandin dehydrogenase [NAD(+)](Homo sapiens (Human))
Case Western Reserve University
US Patent
LigandPNGBDBM347374(US10301320, ID SW208078 | US10869871, ID # SW20807...)
Affinity DataIC50:  25nM. Assay description: Inhibition of recombinant human C-terminal 6xHis-tagged 15-PGDH expressed in Escherichia coli using PGE2 as substrate after 15 mins in presence of NA...
In DepthDetails ArticlePubMed
Target15-hydroxyprostaglandin dehydrogenase [NAD(+)](Homo sapiens (Human))
Case Western Reserve University
US Patent
LigandPNGBDBM347374(US10301320, ID SW208078 | US10869871, ID # SW20807...)
Affinity DataIC50:  25nM. Assay description: This Example provides data on a group of structural analogues of SW033291. Data provided includes level of induction of a 15-PGDH-luciferase fusion g...
In DepthDetails US Patent
Target15-hydroxyprostaglandin dehydrogenase [NAD(+)](Homo sapiens (Human))
Case Western Reserve University
US Patent
LigandPNGBDBM347374(US10301320, ID SW208078 | US10869871, ID # SW20807...)
Affinity DataIC50:  25nM. Assay description: In vivo assays for 15-PGDH expression or 15-PGDH activity, e.g., ligands, agonists, antagonists, and their homologs and mimetics. The term modulator ...
In DepthDetails US Patent