BDBM347433 US10869871, ID # SW209419::US20230285402, ID # SW209419::US9789116, SW209419
SMILES CCCCS(=O)c1sc2nc(cc(-c3cccc(c3)C(O)=O)c2c1N)-c1nccs1
InChI Key InChIKey=BWFPAAMWIGEKEY-UHFFFAOYSA-N
Data  3 IC50
  Tab Delimited (TSV)   2D SDfile   Computed 3D by Vconf -m prep SDfile
Find this compound or compounds like it in BindingDB:
Activity Spreadsheet -- Enzyme Inhibition Constant Data from BindingDB
Found 3 hits for monomerid = 347433
Target15-hydroxyprostaglandin dehydrogenase [NAD(+)](Homo sapiens (Human))
Case Western Reserve University
US Patent
LigandPNGBDBM347433(US10869871, ID # SW209419 | US20230285402, ID # SW...)
Affinity DataIC50:  20.2nM. Assay description: Each compound for inhibiting enzymatic activity of recombinant 15-PGDH in an in vitro assay.
Ligand InfoPC cidPC sid
In DepthDetails US Patent
Target15-hydroxyprostaglandin dehydrogenase [NAD(+)](Homo sapiens (Human))
Case Western Reserve University
US Patent
LigandPNGBDBM347433(US10869871, ID # SW209419 | US20230285402, ID # SW...)
Affinity DataIC50:  20.2nM. Assay description: It is not clearly defined.
Ligand InfoPC cidPC sid
Target15-hydroxyprostaglandin dehydrogenase [NAD(+)](Homo sapiens (Human))
Case Western Reserve University
US Patent
LigandPNGBDBM347433(US10869871, ID # SW209419 | US20230285402, ID # SW...)
Affinity DataIC50:  20.2nM. Assay description: Assays were done by measuring the transfer of tritium from 15(S)-[15-3H] PGE2 to glutamate (at 1 μM PGE2 substrate), or by direct fluorescence m...
Ligand InfoPC cidPC sid