BDBM347442 US10869871, ID # SW211535::US20230285402, ID # SW211535::US9789116, SW211535
SMILES CCCCS(=O)c1sc2nc(cc(-c3cccc(c3)C(=O)NCCO)c2c1N)-c1nccs1
InChI Key InChIKey=OFKGLSDFWPKLEY-UHFFFAOYSA-N
Data  3 IC50
  Tab Delimited (TSV)   2D SDfile   Computed 3D by Vconf -m prep SDfile
Find this compound or compounds like it in BindingDB:
Activity Spreadsheet -- Enzyme Inhibition Constant Data from BindingDB
Found 3 hits for monomerid = 347442
Target15-hydroxyprostaglandin dehydrogenase [NAD(+)](Homo sapiens (Human))
Case Western Reserve University
US Patent
LigandPNGBDBM347442(US10869871, ID # SW211535 | US20230285402, ID # SW...)
Affinity DataIC50:  3.45nM. Assay description: Each compound for inhibiting enzymatic activity of recombinant 15-PGDH in an in vitro assay.
Ligand InfoKEGGPC cidPC sid
In DepthDetails US Patent
Target15-hydroxyprostaglandin dehydrogenase [NAD(+)](Homo sapiens (Human))
Case Western Reserve University
US Patent
LigandPNGBDBM347442(US10869871, ID # SW211535 | US20230285402, ID # SW...)
Affinity DataIC50:  3.45nM. Assay description: It is not clearly defined.
Ligand InfoKEGGPC cidPC sid
Target15-hydroxyprostaglandin dehydrogenase [NAD(+)](Homo sapiens (Human))
Case Western Reserve University
US Patent
LigandPNGBDBM347442(US10869871, ID # SW211535 | US20230285402, ID # SW...)
Affinity DataIC50:  3.45nM. Assay description: Assays were done by measuring the transfer of tritium from 15(S)-[15-3H] PGE2 to glutamate (at 1 μM PGE2 substrate), or by direct fluorescence m...
Ligand InfoKEGGPC cidPC sid