BDBM347468 US9790180, ID 004
SMILES CC1(CCN(CC1)C(=O)N1CCOCC1)Nc1ccc(cc1)C(=O)Nc1cc(ccc1N)-c1cccs1
InChI Key InChIKey=FUQXQEQPYFSDOG-UHFFFAOYSA-N
Data  3 IC50
  Tab Delimited (TSV)   2D SDfile   Computed 3D by Vconf -m prep SDfile
Find this compound or compounds like it in BindingDB:
Activity Spreadsheet -- Enzyme Inhibition Constant Data from BindingDB
Found 3 hits for monomerid = 347468
TargetHistone deacetylase 1(Homo sapiens (Human))
Regenacy Pharmaceuticals
US Patent
LigandPNGBDBM347468(US9790180, ID 004)
Affinity DataIC50:  2nM. Assay description: Compounds for testing were diluted in DMSO to 50 fold the final concentration and a ten point three fold dilution series was made. The compounds were...
Ligand InfoPC cidPC sid
In DepthDetails US Patent
TargetHistone deacetylase 3(Homo sapiens (Human))
Regenacy Pharmaceuticals
US Patent
LigandPNGBDBM347468(US9790180, ID 004)
Affinity DataIC50:  286nM
Ligand InfoPC cidPC sid
In DepthDetails US Patent
TargetHistone deacetylase 2(Homo sapiens (Human))
Regenacy Pharmaceuticals
US Patent
LigandPNGBDBM347468(US9790180, ID 004)
Affinity DataIC50:  21nM
Ligand InfoPC cidPC sid
In DepthDetails US Patent