BDBM347472 US9790180, ID 006
SMILES Nc1ccc(cc1NC(=O)c1ccc(NC2CCN(CC2)C(=O)N2CCCC2)cc1)-c1cccs1
InChI Key InChIKey=QOYGMFSRUKDDBE-UHFFFAOYSA-N
Data  3 IC50
  Tab Delimited (TSV)   2D SDfile   Computed 3D by Vconf -m prep SDfile
Find this compound or compounds like it in BindingDB:
Activity Spreadsheet -- Enzyme Inhibition Constant Data from BindingDB
Found 3 hits for monomerid = 347472
TargetHistone deacetylase 1(Homo sapiens (Human))
Regenacy Pharmaceuticals
US Patent
LigandPNGBDBM347472(US9790180, ID 006)
Affinity DataIC50:  4.70nM. Assay description: Compounds for testing were diluted in DMSO to 50 fold the final concentration and a ten point three fold dilution series was made. The compounds were...
Ligand InfoPC cidPC sid
In DepthDetails US Patent
TargetHistone deacetylase 3(Homo sapiens (Human))
Regenacy Pharmaceuticals
US Patent
LigandPNGBDBM347472(US9790180, ID 006)
Affinity DataIC50:  274nM
Ligand InfoPC cidPC sid
In DepthDetails US Patent
TargetHistone deacetylase 2(Homo sapiens (Human))
Regenacy Pharmaceuticals
US Patent
LigandPNGBDBM347472(US9790180, ID 006)
Affinity DataIC50:  22nM
Ligand InfoPC cidPC sid
In DepthDetails US Patent