BDBM347473 US9790180, ID 007
SMILES CC1(CCN(CC1)C(=O)Oc1ccccc1)Nc1ncc(cn1)C(=O)Nc1cc(ccc1N)-c1cccs1
InChI Key InChIKey=PDXAHHVULTXUPS-UHFFFAOYSA-N
Data  3 IC50
  Tab Delimited (TSV)   2D SDfile   Computed 3D by Vconf -m prep SDfile
Find this compound or compounds like it in BindingDB:
Activity Spreadsheet -- Enzyme Inhibition Constant Data from BindingDB
Found 3 hits for monomerid = 347473
TargetHistone deacetylase 1(Homo sapiens (Human))
Regenacy Pharmaceuticals
US Patent
LigandPNGBDBM347473(US9790180, ID 007)
Affinity DataIC50:  118nM. Assay description: Compounds for testing were diluted in DMSO to 50 fold the final concentration and a ten point three fold dilution series was made. The compounds were...
Ligand InfoPC cidPC sid
In DepthDetails US Patent
TargetHistone deacetylase 3(Homo sapiens (Human))
Regenacy Pharmaceuticals
US Patent
LigandPNGBDBM347473(US9790180, ID 007)
Affinity DataIC50:  929nM
Ligand InfoPC cidPC sid
In DepthDetails US Patent
TargetHistone deacetylase 2(Homo sapiens (Human))
Regenacy Pharmaceuticals
US Patent
LigandPNGBDBM347473(US9790180, ID 007)
Affinity DataIC50:  703nM
Ligand InfoPC cidPC sid
In DepthDetails US Patent