BDBM347521 3-Chloro-5-{[3-(4-methoxy-2-methylphenyl)piperidin-1-yl]carbonyl}pyridazine::US9790201, 7
SMILES CN(C)c1cc(ccn1)C(=O)N1CCCC(C1)c1ccc(Cl)cc1C(F)(F)F
InChI Key InChIKey=SUSPANHNBVUMHH-UHFFFAOYSA-N
Data  1 IC50
  Tab Delimited (TSV)   2D SDfile   Computed 3D by Vconf -m prep SDfile
Find this compound or compounds like it in BindingDB:
Activity Spreadsheet -- Enzyme Inhibition Constant Data from BindingDB
Found 1 hit for monomerid = 347521
TargetProkineticin receptor 1(Homo sapiens (Human))
Takeda Pharmaceutical
US Patent
LigandPNGBDBM347521(3-Chloro-5-{[3-(4-methoxy-2-methylphenyl)piperidin...)
Affinity DataIC50:  100nM. Assay description: Prokineticin receptor 1 (PKR1) antagonists may be functionally assessed by measurement of change in intracellular calcium levels induced by Gq mediat...
Ligand InfoPC cidPC sid
In DepthDetails US Patent