BDBM347537 2-(Azetidin-1-yl)-4-{[3-(2-methylphenyl)piperidin-1-yl]carbonyl}pyridine::US9790201, 23
SMILES Cc1ccccc1C1CCCN(C1)C(=O)c1ccnc(c1)N1CCC1
InChI Key InChIKey=SXSLOFURASAEPV-UHFFFAOYSA-N
Data  1 IC50
  Tab Delimited (TSV)   2D SDfile   Computed 3D by Vconf -m prep SDfile
Find this compound or compounds like it in BindingDB:
Activity Spreadsheet -- Enzyme Inhibition Constant Data from BindingDB
Found 1 hit for monomerid = 347537
TargetProkineticin receptor 1(Homo sapiens (Human))
Takeda Pharmaceutical
US Patent
LigandPNGBDBM347537(2-(Azetidin-1-yl)-4-{[3-(2-methylphenyl)piperidin-...)
Affinity DataIC50:  960nM. Assay description: Prokineticin receptor 1 (PKR1) antagonists may be functionally assessed by measurement of change in intracellular calcium levels induced by Gq mediat...
Ligand InfoPC cidPC sid
In DepthDetails US Patent