BDBM347571 4-({3-[4-Chloro-2-(trifluoromethyl)phenyl]piperidin-1-yl}carbonyl)-N-methylpyridin-2-amine::US9790201, 57
SMILES CNc1cc(ccn1)C(=O)N1CCCC(C1)c1ccc(Cl)cc1C(F)(F)F
InChI Key InChIKey=UMYLOSNSUMKTRX-UHFFFAOYSA-N
Data  1 IC50
  Tab Delimited (TSV)   2D SDfile   Computed 3D by Vconf -m prep SDfile
Find this compound or compounds like it in BindingDB:
Activity Spreadsheet -- Enzyme Inhibition Constant Data from BindingDB
Found 1 hit for monomerid = 347571
TargetProkineticin receptor 1(Homo sapiens (Human))
Takeda Pharmaceutical
US Patent
LigandPNGBDBM347571(4-({3-[4-Chloro-2-(trifluoromethyl)phenyl]piperidi...)
Affinity DataIC50:  50nM. Assay description: Prokineticin receptor 1 (PKR1) antagonists may be functionally assessed by measurement of change in intracellular calcium levels induced by Gq mediat...
Ligand InfoPC cidPC sid
In DepthDetails US Patent