BDBM347580 4-({3-[2-(Difluoromethoxy)phenyl]piperidin-1-yl}carbonyl)-N,N-dimethylpyridin-2-amine::US9790201, 66
SMILES CN(C)c1cc(ccn1)C(=O)N1CCCC(C1)c1ccccc1OC(F)F
InChI Key InChIKey=NFPNIPNPQDSAFO-UHFFFAOYSA-N
Data  1 IC50
  Tab Delimited (TSV)   2D SDfile   Computed 3D by Vconf -m prep SDfile
Find this compound or compounds like it in BindingDB:
Activity Spreadsheet -- Enzyme Inhibition Constant Data from BindingDB
Found 1 hit for monomerid = 347580
TargetProkineticin receptor 1(Homo sapiens (Human))
Takeda Pharmaceutical
US Patent
LigandPNGBDBM347580(4-({3-[2-(Difluoromethoxy)phenyl]piperidin-1-yl}ca...)
Affinity DataIC50:  700nM. Assay description: Prokineticin receptor 1 (PKR1) antagonists may be functionally assessed by measurement of change in intracellular calcium levels induced by Gq mediat...
Ligand InfoPC cidPC sid
In DepthDetails US Patent