BDBM347604 3-(4-Chlorophenyl)-1-[(1-methyl-1H-pyrazol-4-yl)carbonyl]piperidine::US9790201, 89
SMILES Cn1cc(cn1)C(=O)N1CCCC(C1)c1ccc(Cl)cc1
InChI Key InChIKey=QZCUKLYLRNXRFQ-UHFFFAOYSA-N
Data  1 IC50
  Tab Delimited (TSV)   2D SDfile   Computed 3D by Vconf -m prep SDfile
Find this compound or compounds like it in BindingDB:
Activity Spreadsheet -- Enzyme Inhibition Constant Data from BindingDB
Found 1 hit for monomerid = 347604
TargetProkineticin receptor 1(Homo sapiens (Human))
Takeda Pharmaceutical
US Patent
LigandPNGBDBM347604(3-(4-Chlorophenyl)-1-[(1-methyl-1H-pyrazol-4-yl)ca...)
Affinity DataIC50:  1.28E+3nM. Assay description: Prokineticin receptor 1 (PKR1) antagonists may be functionally assessed by measurement of change in intracellular calcium levels induced by Gq mediat...
Ligand InfoPC cidPC sid
In DepthDetails US Patent