BDBM347647 2-[2-[4-[1-methyl-4-(4-pyridyl)pyrazol-3-yl]phenyl]ethynyl]thiazole::US9790203, Example 17
SMILES Cn1cc(c(n1)-c1ccc(cc1)C#Cc1nccs1)-c1ccncc1
InChI Key InChIKey=WZWNMFDITRIGMB-UHFFFAOYSA-N
Data  2 IC50
  Tab Delimited (TSV)   2D SDfile   Computed 3D by Vconf -m prep SDfile
Find this compound or compounds like it in BindingDB:
Activity Spreadsheet -- Enzyme Inhibition Constant Data from BindingDB
Found 2 hits for monomerid = 347647
TargetcAMP and cAMP-inhibited cGMP 3',5'-cyclic phosphodiesterase 10A(Homo sapiens (Human))
Therachem Research Medilab
Curated by ChEMBL
LigandPNGBDBM347647(2-[2-[4-[1-methyl-4-(4-pyridyl)pyrazol-3-yl]phenyl...)
Affinity DataIC50:  100nM. Assay description: Inhibition of recombinant PDE10A (unknown origin) using cAMP/cGMP as substrate incubated for 60 mins by HTRF assay
Ligand InfoPC cidPC sid
In DepthDetails ArticlePubMed
TargetcAMP and cAMP-inhibited cGMP 3',5'-cyclic phosphodiesterase 10A(Homo sapiens (Human))
Therachem Research Medilab
Curated by ChEMBL
LigandPNGBDBM347647(2-[2-[4-[1-methyl-4-(4-pyridyl)pyrazol-3-yl]phenyl...)
Affinity DataIC50:  150nM. Assay description: The PDE enzymatic reaction was carried out in assay buffer (20 mM Tris-HCl pH7.5, 10 mM MgCl2, 0.1% bovine serum albumin) containing enzyme and subst...
Ligand InfoPC cidPC sid
In DepthDetails US Patent