BDBM347648 2-[2-[4-[1-methyl-4-(4-pyridyl)pyrazol-3-yl]phenyl]ethynyl]quinoxaline::US9790203, Example 18
SMILES Cn1cc(c(n1)-c1ccc(cc1)C#Cc1cnc2ccccc2n1)-c1ccncc1
InChI Key InChIKey=HEIFBGABZKSNHR-UHFFFAOYSA-N
Data  1 IC50
  Tab Delimited (TSV)   2D SDfile   Computed 3D by Vconf -m prep SDfile
Find this compound or compounds like it in BindingDB:
Activity Spreadsheet -- Enzyme Inhibition Constant Data from BindingDB
Found 1 hit for monomerid = 347648
TargetcAMP and cAMP-inhibited cGMP 3',5'-cyclic phosphodiesterase 10A(Homo sapiens (Human))
Abbvie
US Patent
LigandPNGBDBM347648(2-[2-[4-[1-methyl-4-(4-pyridyl)pyrazol-3-yl]phenyl...)
Affinity DataIC50: <100nM. Assay description: The PDE enzymatic reaction was carried out in assay buffer (20 mM Tris-HCl pH7.5, 10 mM MgCl2, 0.1% bovine serum albumin) containing enzyme and subst...
Ligand InfoPC cidPC sid
In DepthDetails US Patent