BDBM347655 2-methyl-6-[2-[4-[1-methyl-4-(2-methylpyrazol-3-yl)pyrazol-3-yl]phenyl]ethynyl]-pyridine::US9790203, Example 27
SMILES Cc1cccc(n1)C#Cc1ccc(cc1)-c1nn(C)cc1-c1ccnn1C
InChI Key InChIKey=PLUNUPXEWBXGII-UHFFFAOYSA-N
Data  1 IC50
  Tab Delimited (TSV)   2D SDfile   Computed 3D by Vconf -m prep SDfile
Find this compound or compounds like it in BindingDB:
Activity Spreadsheet -- Enzyme Inhibition Constant Data from BindingDB
Found 1 hit for monomerid = 347655
TargetcAMP and cAMP-inhibited cGMP 3',5'-cyclic phosphodiesterase 10A(Homo sapiens (Human))
Abbvie
US Patent
LigandPNGBDBM347655(2-methyl-6-[2-[4-[1-methyl-4-(2-methylpyrazol-3-yl...)
Affinity DataIC50:  150nM. Assay description: The PDE enzymatic reaction was carried out in assay buffer (20 mM Tris-HCl pH7.5, 10 mM MgCl2, 0.1% bovine serum albumin) containing enzyme and subst...
Ligand InfoPC cidPC sid
In DepthDetails US Patent