BDBM347725 4-[[3-(3-Hydroxyphenyl)-1H-pyrazol-4-yl]oxy]benzonitrile::US9790217, 48
SMILES Oc1cccc(c1)-c1[nH]ncc1Oc1ccc(cc1)C#N
InChI Key InChIKey=CRUHORMPALHGEL-UHFFFAOYSA-N
Data  2 EC50
  Tab Delimited (TSV)   2D SDfile   Computed 3D by Vconf -m prep SDfile
Find this compound or compounds like it in BindingDB:
Activity Spreadsheet -- Enzyme Inhibition Constant Data from BindingDB
Found 2 hits for monomerid = 347725
TargetCytochrome P450 11B1, mitochondrial(Homo sapiens (Human))
Hoffmann-La Roche
US Patent
LigandPNGBDBM347725(4-[[3-(3-Hydroxyphenyl)-1H-pyrazol-4-yl]oxy]benzon...)
Affinity DataEC50:  0.0830nM. Assay description: G-402 cells can be obtained from ATCC (CRL-1440) and were originally derived from a renal leiomyoblastoma.The expression plasmids contains the ORF fo...
Ligand InfoPC cidPC sid
In DepthDetails US Patent
TargetCytochrome P450 11B2, mitochondrial(Homo sapiens (Human))
Hoffmann-La Roche
US Patent
LigandPNGBDBM347725(4-[[3-(3-Hydroxyphenyl)-1H-pyrazol-4-yl]oxy]benzon...)
Affinity DataEC50:  0.0200nM. Assay description: G-402 cells can be obtained from ATCC (CRL-1440) and were originally derived from a renal leiomyoblastoma.The expression plasmids contains the ORF fo...
Ligand InfoPC cidPC sid
In DepthDetails US Patent