BDBM347750 CHEM-US-00164::US9790217, 72
SMILES O=c1ccn(Cc2cccc(c2)-c2[nH]ncc2Oc2ccc(cc2)C#N)cc1
InChI Key InChIKey=FDJYROGIRPRKIR-UHFFFAOYSA-N
Data  2 EC50
  Tab Delimited (TSV)   2D SDfile   Computed 3D by Vconf -m prep SDfile
Find this compound or compounds like it in BindingDB:
Activity Spreadsheet -- Enzyme Inhibition Constant Data from BindingDB
Found 2 hits for monomerid = 347750
TargetCytochrome P450 11B1, mitochondrial(Homo sapiens (Human))
Hoffmann-La Roche
US Patent
LigandPNGBDBM347750(CHEM-US-00164 | US9790217, 72)
Affinity DataEC50:  19.3nM. Assay description: G-402 cells can be obtained from ATCC (CRL-1440) and were originally derived from a renal leiomyoblastoma.The expression plasmids contains the ORF fo...
Ligand InfoPC cidPC sid
In DepthDetails US Patent
TargetCytochrome P450 11B2, mitochondrial(Homo sapiens (Human))
Hoffmann-La Roche
US Patent
LigandPNGBDBM347750(CHEM-US-00164 | US9790217, 72)
Affinity DataEC50:  1.63nM. Assay description: G-402 cells can be obtained from ATCC (CRL-1440) and were originally derived from a renal leiomyoblastoma.The expression plasmids contains the ORF fo...
Ligand InfoPC cidPC sid
In DepthDetails US Patent