BDBM347989 US9790221, Compound 195
SMILES Cn1cc(cn1)-c1cccc(c1)-c1ncc(-c2cnn(C)c2)c(N[C@@H]2C[C@H](CNS(C)(=O)=O)C2)n1
InChI Key InChIKey=VZTDACMGWBXNRQ-NBEIKUQISA-N
Data  2 IC50
  Tab Delimited (TSV)   2D SDfile   Computed 3D by Vconf -m prep SDfile
Find this compound or compounds like it in BindingDB:
Activity Spreadsheet -- Enzyme Inhibition Constant Data from BindingDB
Found 2 hits for monomerid = 347989
TargetInterleukin-1 receptor-associated kinase 4(Homo sapiens (Human))
Merck Patent
US Patent
LigandPNGBDBM347989(US9790221, Compound 195)
Affinity DataIC50: <100nM. Assay description: IRAK4 is a human purified recombinant enzyme (His-TEV-IRAK1 (194-712). IRAK4 hydrolyses ATP, autophosphorylates and phosphorylates a Serine/Threonine...
Ligand InfoPC cidPC sid
In DepthDetails US Patent
TargetInterleukin-1 receptor-associated kinase 1 [194-712](Homo sapiens (Human))
Merck Patent
US Patent
LigandPNGBDBM347989(US9790221, Compound 195)
Affinity DataIC50: <100nM. Assay description: IRAK1 is a human purified recombinant enzyme (His-TEV-IRAK1 (194-712)). In this assay, IRAK-1 hydrolyses ATP and autophosphorylates. Measurement of I...
Ligand InfoPC cidPC sid
In DepthDetails US Patent