BDBM348089 US9790228, Compound 8
SMILES Cc1ccccc1-c1nc2c(C)cccc2cc1Cn1nc(-c2cc(O)cc(F)c2)c2c(N)ncnc12
InChI Key InChIKey=RPHZUMGEEOXXDG-UHFFFAOYSA-N
Data  4 IC50
  Tab Delimited (TSV)   2D SDfile   Computed 3D by Vconf -m prep SDfile
Find this compound or compounds like it in BindingDB:
Activity Spreadsheet -- Enzyme Inhibition Constant Data from BindingDB
Found 4 hits for monomerid = 348089
LigandPNGBDBM348089(US9790228, Compound 8)
Affinity DataIC50: <100nM. Assay description: Class I PI3-Ks can be either purchased (p110α/p85α, p110β/p85α, p110δ/p85α from Upstate, and p110γ from Sigma) or ...
Ligand InfoPC cidPC sid
In DepthDetails US Patent
LigandPNGBDBM348089(US9790228, Compound 8)
Affinity DataIC50: >1.00E+3nM. Assay description: Class I PI3-Ks can be either purchased (p110α/p85α, p110β/p85α, p110δ/p85α from Upstate, and p110γ from Sigma) or ...
Ligand InfoPC cidPC sid
In DepthDetails US Patent
TargetPhosphatidylinositol 3-kinase regulatory subunit alpha(Homo sapiens (Human))
Intellikine
US Patent
LigandPNGBDBM348089(US9790228, Compound 8)
Affinity DataIC50: >1.00E+3nM. Assay description: Class I PI3-Ks can be either purchased (p110α/p85α, p110β/p85α, p110δ/p85α from Upstate, and p110γ from Sigma) or ...
Ligand InfoPC cidPC sid
In DepthDetails US Patent
LigandPNGBDBM348089(US9790228, Compound 8)
Affinity DataIC50: <100nM. Assay description: Class I PI3-Ks can be either purchased (p110α/p85α, p110β/p85α, p110δ/p85α from Upstate, and p110γ from Sigma) or ...
Ligand InfoPC cidPC sid
In DepthDetails US Patent