BDBM348149 US9790228, Compound 68
SMILES CCN(CC)c1nc2ccccc2cc1Cn1nc(-c2cc(O)cc(F)c2)c2c(N)ncnc12
InChI Key InChIKey=HLHDWOQYFQCFHT-UHFFFAOYSA-N
Data  4 IC50
  Tab Delimited (TSV)   2D SDfile   Computed 3D by Vconf -m prep SDfile
Find this compound or compounds like it in BindingDB:
Activity Spreadsheet -- Enzyme Inhibition Constant Data from BindingDB
Found 4 hits for monomerid = 348149
LigandPNGBDBM348149(US9790228, Compound 68)
Affinity DataIC50: <100nM. Assay description: Class I PI3-Ks can be either purchased (p110α/p85α, p110β/p85α, p110δ/p85α from Upstate, and p110γ from Sigma) or ...
Ligand InfoPC cidPC sid
In DepthDetails US Patent
LigandPNGBDBM348149(US9790228, Compound 68)
Affinity DataIC50:  550nM. Assay description: Class I PI3-Ks can be either purchased (p110α/p85α, p110β/p85α, p110δ/p85α from Upstate, and p110γ from Sigma) or ...
Ligand InfoPC cidPC sid
In DepthDetails US Patent
TargetPhosphatidylinositol 3-kinase regulatory subunit alpha(Homo sapiens (Human))
Intellikine
US Patent
LigandPNGBDBM348149(US9790228, Compound 68)
Affinity DataIC50: >1.00E+3nM. Assay description: Class I PI3-Ks can be either purchased (p110α/p85α, p110β/p85α, p110δ/p85α from Upstate, and p110γ from Sigma) or ...
Ligand InfoPC cidPC sid
In DepthDetails US Patent
LigandPNGBDBM348149(US9790228, Compound 68)
Affinity DataIC50:  550nM. Assay description: Class I PI3-Ks can be either purchased (p110α/p85α, p110β/p85α, p110δ/p85α from Upstate, and p110γ from Sigma) or ...
Ligand InfoPC cidPC sid
In DepthDetails US Patent