BDBM348616 US10577374, Compound 339::US9790229, Compound 339
SMILES FC(F)(F)[C@H]1CCN(C[C@@H]1N1CCCC(Nc2cc(Cl)cc(Cl)c2)C1=O)c1ncnc2[nH]ccc12
InChI Key
Data  2 IC50
  Tab Delimited (TSV)   2D SDfile   Computed 3D by Vconf -m prep SDfile
Find this compound or compounds like it in BindingDB:
Activity Spreadsheet -- Enzyme Inhibition Constant Data from BindingDB
Found 2 hits for monomerid = 348616
TargetTyrosine-protein kinase BTK(Homo sapiens (Human))
Sunesis Pharmaceuticals
US Patent
LigandPNGBDBM348616(US10577374, Compound 339 | US9790229, Compound 339)
Affinity DataIC50: <100nM. Assay description: BTK-POLYGAT-LS ASSAY. The purpose of the BTK in vitro assay is to determine compound potency against BTK through the measurement of IC50. Compound in...
Ligand InfoPC cidPC sid
In DepthDetails US Patent
TargetTyrosine-protein kinase BTK(Homo sapiens (Human))
Sunesis Pharmaceuticals
US Patent
LigandPNGBDBM348616(US10577374, Compound 339 | US9790229, Compound 339)
Affinity DataIC50: <100nM. Assay description: The purpose of the BTK in vitro assay is to determine compound potency against BTK through the measurement of IC50. Compound inhibition is measured a...
Ligand InfoPC cidPC sid
In DepthDetails US Patent