BDBM348695 N-(4-Fluorophenyl)-4-[(1S,3R,4S)-2-oxa-5-azabicyclo[2.2.1]heptan-3-yl]benzamide::US9790230, Example 57
SMILES Fc1ccc(NC(=O)c2ccc(cc2)[C@H]2O[C@@H]3CN[C@H]2C3)cc1
InChI Key InChIKey=WTHYNHIZGZOEBU-YESZJQIVSA-N
Data  2 IC50
  Tab Delimited (TSV)   2D SDfile   Computed 3D by Vconf -m prep SDfile
Find this compound or compounds like it in BindingDB:
Activity Spreadsheet -- Enzyme Inhibition Constant Data from BindingDB
Found 2 hits for monomerid = 348695
TargetTrace amine-associated receptor 1(Rattus norvegicus (Rat))
Hoffmann-La Roche
US Patent
LigandPNGBDBM348695(N-(4-Fluorophenyl)-4-[(1S,3R,4S)-2-oxa-5-azabicycl...)
Affinity DataIC50:  45.8nM. Assay description: HEK-293 cells stably expressing mouse TAAR1 were maintained at 37° C. and 5% CO2 in DMEM high glucose medium, containing fetal calf serum (10%, heat ...
Ligand InfoPC cidPC sid
In DepthDetails US Patent
TargetTrace amine-associated receptor 1(Mus musculus (Mouse))
Hoffmann-La Roche
US Patent
LigandPNGBDBM348695(N-(4-Fluorophenyl)-4-[(1S,3R,4S)-2-oxa-5-azabicycl...)
Affinity DataIC50:  3.40nM. Assay description: HEK-293 cells stably expressing rat TAAR1 were maintained at 37° C. and 5% CO2 in DMEM high glucose medium, containing fetal calf serum (10%, heat in...
Ligand InfoPC cidPC sid
In DepthDetails US Patent