BDBM348798 US9790235, Number I-49
SMILES C[C@@H]1CNc2c(sc3ccc4nc(Nc5cc(F)nc(O[C@@H]6CCN(C)C6)n5)ccc4c23)C(=O)N1
InChI Key InChIKey=NFIJZTODXJCVRL-CHWSQXEVSA-N
Data  1 IC50
  Tab Delimited (TSV)   2D SDfile   Computed 3D by Vconf -m prep SDfile
Find this compound or compounds like it in BindingDB:
Activity Spreadsheet -- Enzyme Inhibition Constant Data from BindingDB
Found 1 hit for monomerid = 348798
TargetMAP kinase-activated protein kinase 2(Homo sapiens (Human))
Celgene Car
US Patent
LigandPNGBDBM348798(US9790235, Number I-49)
Affinity DataIC50: <100nM. Assay description: Compounds I-1 through I-50 of the invention were assayed in a mass spectrometric assay to measure their ability to covalently modify MK2 protein. The...
Ligand InfoPC cidPC sid
In DepthDetails US Patent