BDBM348838 US9790235, Number I-91
SMILES CC(C)N(C)Cc1cnc(Cl)nc1Oc1ccc2c3c4NC[C@@H](C)NC(=O)c4sc3ccc2n1
InChI Key InChIKey=GIPBOZMOWOAZDM-CYBMUJFWSA-N
Data  1 IC50
  Tab Delimited (TSV)   2D SDfile   Computed 3D by Vconf -m prep SDfile
Find this compound or compounds like it in BindingDB:
Activity Spreadsheet -- Enzyme Inhibition Constant Data from BindingDB
Found 1 hit for monomerid = 348838
TargetMAP kinase-activated protein kinase 2(Homo sapiens (Human))
Celgene Car
US Patent
LigandPNGBDBM348838(US9790235, Number I-91)
Affinity DataIC50: <100nM. Assay description: Compounds I-1 through I-50 of the invention were assayed in a mass spectrometric assay to measure their ability to covalently modify MK2 protein. The...
Ligand InfoPC cidPC sid
In DepthDetails US Patent