BDBM348998 N-(5-(4-(2-(3- fluorophenylamino)-2- oxoethoxy)phenyl)- [1,2,4]triazolo[1,5-a]pyridin-2- yl)cyclopropanecarboxamide::US10206907, Compound 116
SMILES Fc1cccc(NC(=O)COc2ccc(cc2)-c2cccc3nc(NC(=O)C4CC4)nn23)c1
InChI Key InChIKey=NFWZCVLUMYWRPC-UHFFFAOYSA-N
Data  4 IC50
  Tab Delimited (TSV)   2D SDfile   Computed 3D by Vconf -m prep SDfile
Find this compound or compounds like it in BindingDB:
Activity Spreadsheet -- Enzyme Inhibition Constant Data from BindingDB
Found 4 hits for monomerid = 348998
TargetTyrosine-protein kinase JAK3 [781-1124](Homo sapiens (Human))
Galapagos
US Patent
LigandPNGBDBM348998(N-(5-(4-(2-(3- fluorophenylamino)-2- oxoethoxy)phe...)
Affinity DataIC50:  550nM. Assay description: Recombinant human JAK3 catalytic domain (amino acids 781-1124; catalog number PV3855) was purchased from Invitrogen. 0.025 mU of JAK3 was incubated w...
Ligand InfoPC cidPC sid
In DepthDetails US Patent
TargetTyrosine-protein kinase JAK2 [808-1132](Homo sapiens (Human))
Galapagos
US Patent
LigandPNGBDBM348998(N-(5-(4-(2-(3- fluorophenylamino)-2- oxoethoxy)phe...)
Affinity DataIC50:  300nM. Assay description: Recombinant human JAK2 catalytic domain (amino acids 808-1132; catalog number PV4210) was purchased from Invitrogen. 0.025 mU of JAK2 was incubated w...
Ligand InfoPC cidPC sid
In DepthDetails US Patent
TargetTyrosine-protein kinase JAK1 [850-1154](Homo sapiens (Human))
Galapagos
US Patent
LigandPNGBDBM348998(N-(5-(4-(2-(3- fluorophenylamino)-2- oxoethoxy)phe...)
Affinity DataIC50: <100nM. Assay description: Recombinant human JAK1 catalytic domain (amino acids 850-1154; catalog number 08-144) was purchased from Carna Biosciences. 10 ng of JAK1 was incubat...
Ligand InfoPC cidPC sid
In DepthDetails US Patent
TargetNon-receptor tyrosine-protein kinase TYK2 [871-1187](Homo sapiens (Human))
Galapagos
US Patent
LigandPNGBDBM348998(N-(5-(4-(2-(3- fluorophenylamino)-2- oxoethoxy)phe...)
Affinity DataIC50: >1.00E+3nM. Assay description: Recombinant human TYK2 catalytic domain (amino acids 871-1187; catalog number 08-147) was purchased from Carna biosciences. 5 ng of TYK2 was incubate...
Ligand InfoPC cidPC sid
In DepthDetails US Patent