BDBM349071 US10206907, Compound 190::methyl 6-((4-(2- (cyclopropanecarboxamido)- [1,2,4]triazolo[1,5-a]pyridin-5- yl)phenylcyclopropanecarbox- amido)-[1,2,4]triazolo[1,5- a]pyridin-5- yl)phenoxy)methyl)nicotinate
SMILES COC(=O)c1ccc(COc2ccc(cc2)-c2cccc3nc(NC(=O)C4CC4)nn23)nc1
InChI Key InChIKey=GDXRXQBZEQGBTN-UHFFFAOYSA-N
Data  1 IC50
  Tab Delimited (TSV)   2D SDfile   Computed 3D by Vconf -m prep SDfile
Find this compound or compounds like it in BindingDB:
Activity Spreadsheet -- Enzyme Inhibition Constant Data from BindingDB
Found 1 hit for monomerid = 349071
TargetTyrosine-protein kinase JAK1 [850-1154](Homo sapiens (Human))
Galapagos
US Patent
LigandPNGBDBM349071(US10206907, Compound 190 | methyl 6-((4-(2- (cyclo...)
Affinity DataIC50: <100nM. Assay description: Recombinant human JAK1 catalytic domain (amino acids 850-1154; catalog number 08-144) was purchased from Carna Biosciences. 10 ng of JAK1 was incubat...
Ligand InfoPC cidPC sid
In DepthDetails US Patent