BDBM34922 3-(3-methylolanilino)-5-nitro-indol-2-one::3-[3-(hydroxymethyl)anilino]-5-nitro-2-indolone::3-[3-(hydroxymethyl)anilino]-5-nitroindol-2-one::3-[[3-(hydroxymethyl)phenyl]amino]-5-nitro-indol-2-one::MLS000710735::SMR000280502::cid_3109108
SMILES OCc1cccc(c1)\[NH+]=C1/C(=O)[N-]c2ccc(cc12)[N+]([O-])=O
InChI Key InChIKey=QEXXQXQOKDLQOY-UHFFFAOYSA-N
Data  6 IC50
  Tab Delimited (TSV)   2D SDfile   Computed 3D by Vconf -m prep SDfile
Find this compound or compounds like it in BindingDB:
Activity Spreadsheet -- Enzyme Inhibition Constant Data from BindingDB
Found 6 hits for monomerid = 34922
TargetMannose-6-phosphate isomerase(Homo sapiens (Human))
Burnham Center For Chemical Genomics
Curated by PubChem BioAssay
LigandPNGBDBM34922(3-(3-methylolanilino)-5-nitro-indol-2-one | 3-[3-(...)
Affinity DataIC50:  1.24E+4nMpH: 7.4 T: 2°C. Assay description: The purpose of this assay is to identify non-competititve inhibitors of human PMI. This is accomplished by using a G6PD- NADPH-coupled assay. In the ...
In DepthDetails PCBioAssay
TargetSUMO-conjugating enzyme UBC9(Homo sapiens (Human))
Burnham Center For Chemical Genomics
Curated by PubChem BioAssay
LigandPNGBDBM34922(3-(3-methylolanilino)-5-nitro-indol-2-one | 3-[3-(...)
Affinity DataIC50:  5.51E+3nM. Assay description: Data Source: Sanford-Burnham Center for Chemical Genomics (SBCCG) Source Affiliation: Sanford-Burnham Medical Research Institute (SBMRI, San Diego, C...
In DepthDetails PCBioAssay
TargetSentrin-specific protease 8(Homo sapiens (Human))
Burnham Center For Chemical Genomics
Curated by PubChem BioAssay
LigandPNGBDBM34922(3-(3-methylolanilino)-5-nitro-indol-2-one | 3-[3-(...)
Affinity DataIC50:  7.06E+3nM
In DepthDetails PCBioAssay
TargetApelin receptor(Homo sapiens (Human))
Sanford-Burnham Center For Chemical Genomics
Curated by PubChem BioAssay
LigandPNGBDBM34922(3-(3-methylolanilino)-5-nitro-indol-2-one | 3-[3-(...)
Affinity DataIC50: >4.00E+4nM. Assay description: Data Source: Sanford-Burnham Center for Chemical Genomics (SBCCG) Source Affiliation: Sanford- Sanford-Burnham Medical Research Institute(SBMRI, San...
In DepthDetails PCBioAssay
TargetSentrin-specific protease 8(Homo sapiens (Human))
Burnham Center For Chemical Genomics
Curated by PubChem BioAssay
LigandPNGBDBM34922(3-(3-methylolanilino)-5-nitro-indol-2-one | 3-[3-(...)
Affinity DataIC50:  7.06E+3nM
In DepthDetails PCBioAssay
TargetSUMO-activating enzyme subunit 1(Homo sapiens (Human))
Burnham Center For Chemical Genomics
Curated by PubChem BioAssay
LigandPNGBDBM34922(3-(3-methylolanilino)-5-nitro-indol-2-one | 3-[3-(...)
Affinity DataIC50:  1.87E+4nM. Assay description: Data Source: Sanford-Burnham Center for Chemical Genomics (SBCCG) Source Affiliation: Sanford-Burnham Medical Research Institute (SBMRI, San Diego, C...
In DepthDetails PCBioAssay