BDBM349227 (4R)-4-methyl-6-[3-(1-methylpyrazol-4-yl)-1H-indazol-5-yl]-1,3,4,5-tetrahydro-1,5-benzodiazepin-2-one::US10206931, Example 34
SMILES CN\C=C(/C=N)C(=N)c1cc(ccc1N)-c1cccc2NC(=O)C[C@@H](C)Nc12
InChI Key InChIKey=NPQTUOZZCOKIQG-JZBPTJMUSA-N
Data  2 IC50
  Tab Delimited (TSV)   2D SDfile   Computed 3D by Vconf -m prep SDfile
Find this compound or compounds like it in BindingDB:
Activity Spreadsheet -- Enzyme Inhibition Constant Data from BindingDB
Found 2 hits for monomerid = 349227
TargetBromodomain-containing protein 4 [42-168](Homo sapiens (Human))
Genentech
US Patent
LigandPNGBDBM349227((4R)-4-methyl-6-[3-(1-methylpyrazol-4-yl)-1H-indaz...)
Affinity DataIC50:  3.13E+3nM. Assay description: His/Flag epitope tagged BRD4 BD142-168 was cloned, expressed, and purified to. BRD4 binding and inhibition was assessed by monitoring the engagement ...
Ligand InfoPC cidPC sid
In DepthDetails US Patent
TargetCREB-binding protein(Homo sapiens (Human))
Genentech
US Patent
LigandPNGBDBM349227((4R)-4-methyl-6-[3-(1-methylpyrazol-4-yl)-1H-indaz...)
Affinity DataIC50:  27nM. Assay description: His/Flag epitope tagged CBP was cloned, expressed, and purified to homogeneity. CBP binding and inhibition was assessed by monitoring the engagement ...
Ligand InfoPC cidPC sid
In DepthDetails US Patent