BDBM349323 US10207991, Ex. Cpd. No. 7::US10611728, Example Compound 7::US11691947, Example 7
SMILES COc1cc(CC[C@@H](C)N2Cc3cc(OC)c(OC)cc3C2)ccc1O
InChI Key InChIKey=PPPGEPQJNAMZSS-CQSZACIVSA-N
Data  8 KI
  Tab Delimited (TSV)   2D SDfile   Computed 3D by Vconf -m prep SDfile
Find this compound or compounds like it in BindingDB:
Activity Spreadsheet -- Enzyme Inhibition Constant Data from BindingDB
Found 8 hits for monomerid = 349323
TargetSigma non-opioid intracellular receptor 1(Cavia porcellus (Guinea pig))
Cognition Therapeutics
US Patent
LigandPNGBDBM349323(US10207991, Ex. Cpd. No. 7 | US10611728, Example C...)
Affinity DataKi:  42nM. Assay description: The affinity of candidate sigma-2 ligand compounds at sigma-1 and sigma-2 receptors was also determined by displacement of different known labeled si...
Ligand InfoPC cidPC sid
In DepthDetails US Patent
TargetSigma non-opioid intracellular receptor 1(Homo sapiens (Human))
Cognition Therapeutics
US Patent
LigandPNGBDBM349323(US10207991, Ex. Cpd. No. 7 | US10611728, Example C...)
Affinity DataKi:  42nM. Assay description: Radioligand binding assays for Sigma-1 receptors and Sigma-2 receptors were carried out by a commercial contract research organization. For Sigma-1 b...
Ligand InfoPC cidPC sid
In DepthDetails US Patent
TargetSigma non-opioid intracellular receptor 1(Homo sapiens (Human))
Cognition Therapeutics
US Patent
LigandPNGBDBM349323(US10207991, Ex. Cpd. No. 7 | US10611728, Example C...)
Affinity DataKi:  42nM. Assay description: Radioligand binding assays for Sigma-1 receptors and Sigma-2 receptors were carried out by a commercial contract research organization. For Sigma-1 b...
Ligand InfoPC cidPC sid
In DepthDetails US Patent
TargetSigma non-opioid intracellular receptor 1(Homo sapiens (Human))
Cognition Therapeutics
US Patent
LigandPNGBDBM349323(US10207991, Ex. Cpd. No. 7 | US10611728, Example C...)
Affinity DataKi:  42nM. Assay description: The affinity of candidate sigma-2 ligand compounds at sigma-1 and sigma-2 receptors was also determined by displacement of different known labeled si...
Ligand InfoPC cidPC sid
In DepthDetails US Patent
TargetSigma intracellular receptor 2(Homo sapiens (Human))
Cognition Therapeutics
US Patent
LigandPNGBDBM349323(US10207991, Ex. Cpd. No. 7 | US10611728, Example C...)
Affinity DataKi:  68nM. Assay description: Radioligand binding assays for Sigma-1 receptors and Sigma-2 receptors were carried out by a commercial contract research organization. For Sigma-1 b...
Ligand InfoPC cidPC sid
In DepthDetails US Patent
TargetSigma intracellular receptor 2(Rattus norvegicus (Rat))
Cognition Therapeutics
US Patent
LigandPNGBDBM349323(US10207991, Ex. Cpd. No. 7 | US10611728, Example C...)
Affinity DataKi:  68nM. Assay description: The affinity of candidate sigma-2 ligand compounds at sigma-1 and sigma-2 receptors was also determined by displacement of different known labeled si...
Ligand InfoPC cidPC sid
In DepthDetails US Patent
TargetSigma intracellular receptor 2(Homo sapiens (Human))
Cognition Therapeutics
US Patent
LigandPNGBDBM349323(US10207991, Ex. Cpd. No. 7 | US10611728, Example C...)
Affinity DataKi:  68nM. Assay description: The affinity of candidate sigma-2 ligand compounds at sigma-1 and sigma-2 receptors was also determined by displacement of different known labeled si...
Ligand InfoPC cidPC sid
In DepthDetails US Patent
TargetSigma intracellular receptor 2(Homo sapiens (Human))
Cognition Therapeutics
US Patent
LigandPNGBDBM349323(US10207991, Ex. Cpd. No. 7 | US10611728, Example C...)
Affinity DataKi:  68nM. Assay description: Radioligand binding assays for Sigma-1 receptors and Sigma-2 receptors were carried out by a commercial contract research organization. For Sigma-1 b...
Ligand InfoPC cidPC sid
In DepthDetails US Patent