BDBM349387 US10207991, Ex. Cpd. No. 18::US10611728, Example Compound 18::US11691947, Example 18
SMILES C[C@H](CCc1ccc(Cl)c(Cl)c1)N1Cc2cc3ccccc3cc2C1
InChI Key InChIKey=OAOQXTSHNQBGOT-OAHLLOKOSA-N
Data  8 KI
  Tab Delimited (TSV)   2D SDfile   Computed 3D by Vconf -m prep SDfile
Find this compound or compounds like it in BindingDB:
Activity Spreadsheet -- Enzyme Inhibition Constant Data from BindingDB
Found 8 hits for monomerid = 349387
TargetSigma intracellular receptor 2(Homo sapiens (Human))
Cognition Therapeutics
US Patent
LigandPNGBDBM349387(US10207991, Ex. Cpd. No. 18 | US10611728, Example ...)
Affinity DataKi:  1.5nM. Assay description: Radioligand binding assays for Sigma-1 receptors and Sigma-2 receptors were carried out by a commercial contract research organization. For Sigma-1 b...
Ligand InfoPC cidPC sid
In DepthDetails US Patent
TargetSigma intracellular receptor 2(Homo sapiens (Human))
Cognition Therapeutics
US Patent
LigandPNGBDBM349387(US10207991, Ex. Cpd. No. 18 | US10611728, Example ...)
Affinity DataKi:  1.5nM. Assay description: Radioligand binding assays for Sigma-1 receptors and Sigma-2 receptors were carried out by a commercial contract research organization. For Sigma-1 b...
Ligand InfoPC cidPC sid
In DepthDetails US Patent
TargetSigma intracellular receptor 2(Rattus norvegicus (Rat))
Cognition Therapeutics
US Patent
LigandPNGBDBM349387(US10207991, Ex. Cpd. No. 18 | US10611728, Example ...)
Affinity DataKi:  1.5nM. Assay description: The affinity of candidate sigma-2 ligand compounds at sigma-1 and sigma-2 receptors was also determined by displacement of different known labeled si...
Ligand InfoPC cidPC sid
In DepthDetails US Patent
TargetSigma intracellular receptor 2(Homo sapiens (Human))
Cognition Therapeutics
US Patent
LigandPNGBDBM349387(US10207991, Ex. Cpd. No. 18 | US10611728, Example ...)
Affinity DataKi:  1.5nM. Assay description: The affinity of candidate sigma-2 ligand compounds at sigma-1 and sigma-2 receptors was also determined by displacement of different known labeled si...
Ligand InfoPC cidPC sid
In DepthDetails US Patent
TargetSigma non-opioid intracellular receptor 1(Cavia porcellus (Guinea pig))
Cognition Therapeutics
US Patent
LigandPNGBDBM349387(US10207991, Ex. Cpd. No. 18 | US10611728, Example ...)
Affinity DataKi:  42nM. Assay description: The affinity of candidate sigma-2 ligand compounds at sigma-1 and sigma-2 receptors was also determined by displacement of different known labeled si...
Ligand InfoPC cidPC sid
In DepthDetails US Patent
TargetSigma non-opioid intracellular receptor 1(Homo sapiens (Human))
Cognition Therapeutics
US Patent
LigandPNGBDBM349387(US10207991, Ex. Cpd. No. 18 | US10611728, Example ...)
Affinity DataKi:  42nM. Assay description: Radioligand binding assays for Sigma-1 receptors and Sigma-2 receptors were carried out by a commercial contract research organization. For Sigma-1 b...
Ligand InfoPC cidPC sid
In DepthDetails US Patent
TargetSigma non-opioid intracellular receptor 1(Homo sapiens (Human))
Cognition Therapeutics
US Patent
LigandPNGBDBM349387(US10207991, Ex. Cpd. No. 18 | US10611728, Example ...)
Affinity DataKi:  42nM. Assay description: Radioligand binding assays for Sigma-1 receptors and Sigma-2 receptors were carried out by a commercial contract research organization. For Sigma-1 b...
Ligand InfoPC cidPC sid
In DepthDetails US Patent
TargetSigma non-opioid intracellular receptor 1(Homo sapiens (Human))
Cognition Therapeutics
US Patent
LigandPNGBDBM349387(US10207991, Ex. Cpd. No. 18 | US10611728, Example ...)
Affinity DataKi:  42nM. Assay description: The affinity of candidate sigma-2 ligand compounds at sigma-1 and sigma-2 receptors was also determined by displacement of different known labeled si...
Ligand InfoPC cidPC sid
In DepthDetails US Patent