BDBM349588 US10208000, Compound 30
SMILES Brc1ccc(NS(=O)(=O)c2ccc3[nH]c(=O)c(=O)[nH]c3c2)cc1
InChI Key InChIKey=NESCUKRAVDFFCC-UHFFFAOYSA-N
Data  1 IC50
  Tab Delimited (TSV)   2D SDfile   Computed 3D by Vconf -m prep SDfile
Find this compound or compounds like it in BindingDB:
Activity Spreadsheet -- Enzyme Inhibition Constant Data from BindingDB
Found 1 hit for monomerid = 349588
TargetN-acetyltransferase Eis(Mycobacterium tuberculosis (strain ATCC 25618 / H3...)
University Of Kentucky Research Foundation
US Patent
LigandPNGBDBM349588(US10208000, Compound 30)
Affinity DataIC50:  6.20E+3nM. Assay description: To investigate the potential of these compounds as Eis inhibitors for use in combination with KAN, their biochemical (IC50 values against purified Ei...
Ligand InfoPC cidPC sid
In DepthDetails US Patent