BDBM349716 2-((4-(6-(Benzyloxy)pyridin-2-yl)piperidin-1-yl)methyl)-1-methyl-1H-benzo[d]imidazole-6-carboxylic acid::US10208019, Example 9A-01
SMILES Cn1c(CN2CCC(CC2)c2cccc(OCc3ccccc3)n2)nc2ccc(cc12)C(O)=O
InChI Key InChIKey=ICFURHQAHRYUKG-UHFFFAOYSA-N
Data  1 EC50
  Tab Delimited (TSV)   2D SDfile   Computed 3D by Vconf -m prep SDfile
Find this compound or compounds like it in BindingDB:
Activity Spreadsheet -- Enzyme Inhibition Constant Data from BindingDB
Found 1 hit for monomerid = 349716
TargetGlucagon-like peptide 1 receptor(Homo sapiens (Human))
Pfizer
US Patent
LigandPNGBDBM349716(2-((4-(6-(Benzyloxy)pyridin-2-yl)piperidin-1-yl)me...)
Affinity DataEC50:  1.20E+3nM. Assay description: GLP-1R-mediated agonist activity was determined with a cell-based functional assay utilizing an HTRF (Homogeneous Time-Resolved Fluorescence) cAMP de...
Ligand InfoPC cidPC sid
In DepthDetails US Patent