BDBM349834 2-[(4-{6-[(4-chloro-2-fluorobenzyl)oxy]pyridin-2-yl}piperidin-1-yl)methyl]-1-(4H-1,2,4-triazol-3-ylmethyl)-1H-benzimidazole-6-carboxylic acid::US10208019, Example 11A-25
SMILES OC(=O)c1ccc2nc(CN3CCC(CC3)c3cccc(OCc4ccc(Cl)cc4F)n3)n(Cc3nnc[nH]3)c2c1
InChI Key InChIKey=DEWPZZYAJPWTCX-UHFFFAOYSA-N
Data  2 EC50
  Tab Delimited (TSV)   2D SDfile   Computed 3D by Vconf -m prep SDfile
Find this compound or compounds like it in BindingDB:
Activity Spreadsheet -- Enzyme Inhibition Constant Data from BindingDB
Found 2 hits for monomerid = 349834
TargetGlucagon-like peptide 1 receptor(Homo sapiens (Human))
Pfizer
US Patent
LigandPNGBDBM349834(2-[(4-{6-[(4-chloro-2-fluorobenzyl)oxy]pyridin-2-y...)
Affinity DataEC50:  360nM. Assay description: GLP-1R-mediated agonist activity was determined with a cell-based functional assay utilizing an HTRF (Homogeneous Time-Resolved Fluorescence) cAMP de...
Ligand InfoPC cidPC sid
In DepthDetails US Patent
TargetGlucagon-like peptide 1 receptor(Homo sapiens (Human))
Pfizer
US Patent
LigandPNGBDBM349834(2-[(4-{6-[(4-chloro-2-fluorobenzyl)oxy]pyridin-2-y...)
Affinity DataEC50:  30nM. Assay description: GLP-1R-mediated agonist activity was determined with a cell-based functional assay utilizing an HTRF (Homogeneous Time-Resolved Fluorescence) cAMP de...
Ligand InfoPC cidPC sid
In DepthDetails US Patent