BDBM349936 (S)-5-(4-(2-(4-chlorobenzyl)piperazin-1-yl)piperidin-1-yl)-4H-1,2,4-triazol-3-amine ::US10208020, Example 26
SMILES Nc1nnc([nH]1)N1CCC(CC1)N1CCNC[C@@H]1Cc1ccc(Cl)cc1
InChI Key
Data  2 IC50
  Tab Delimited (TSV)   2D SDfile   Computed 3D by Vconf -m prep SDfile
Find this compound or compounds like it in BindingDB:
Activity Spreadsheet -- Enzyme Inhibition Constant Data from BindingDB
Found 2 hits for monomerid = 349936
TargetChitotriosidase-1(Homo sapiens (Human))
Oncoarendi Therapeutics
US Patent
LigandPNGBDBM349936((S)-5-(4-(2-(4-chlorobenzyl)piperazin-1-yl)piperid...)
Affinity DataIC50:  5.50E+3nM. Assay description: An enzymatic assay with recombinant human CHIT1 was used in order to establish inhibitory activity of the compounds (Boot et al., 2001, JBC: 276). Th...
Ligand InfoPC cidPC sid
In DepthDetails US Patent
TargetAcidic mammalian chitinase(Homo sapiens (Human))
Oncoarendi Therapeutics
US Patent
LigandPNGBDBM349936((S)-5-(4-(2-(4-chlorobenzyl)piperazin-1-yl)piperid...)
Affinity DataIC50:  550nM. Assay description: An enzymatic assay with recombinant human AMCase was used in order to establish inhibitory activity of the compounds (Boot et al., 2001, JBC: 276). T...
Ligand InfoPC cidPC sid
In DepthDetails US Patent