BDBM349940 ((2R,5S)-4-(1-(5-amino-4H-1,2,4-triazol-3-yl)piperidin-4-yl)-5-(4-chlorobenzyl)-1-methylpiperazin-2-yl)methanol ::US10208020, Example 30
SMILES CN1C[C@H](Cc2ccc(Cl)cc2)N(C[C@@H]1CO)C1CCN(CC1)c1nnc(N)[nH]1
InChI Key
Data  2 IC50
  Tab Delimited (TSV)   2D SDfile   Computed 3D by Vconf -m prep SDfile
Find this compound or compounds like it in BindingDB:
Activity Spreadsheet -- Enzyme Inhibition Constant Data from BindingDB
Found 2 hits for monomerid = 349940
TargetChitotriosidase-1(Homo sapiens (Human))
Oncoarendi Therapeutics
US Patent
LigandPNGBDBM349940(((2R,5S)-4-(1-(5-amino-4H-1,2,4-triazol-3-yl)piper...)
Affinity DataIC50:  5.50E+3nM. Assay description: An enzymatic assay with recombinant human CHIT1 was used in order to establish inhibitory activity of the compounds (Boot et al., 2001, JBC: 276). Th...
Ligand InfoPC cidPC sid
In DepthDetails US Patent
TargetAcidic mammalian chitinase(Homo sapiens (Human))
Oncoarendi Therapeutics
US Patent
LigandPNGBDBM349940(((2R,5S)-4-(1-(5-amino-4H-1,2,4-triazol-3-yl)piper...)
Affinity DataIC50:  550nM. Assay description: An enzymatic assay with recombinant human AMCase was used in order to establish inhibitory activity of the compounds (Boot et al., 2001, JBC: 276). T...
Ligand InfoPC cidPC sid
In DepthDetails US Patent