BDBM350005 1-((4-(5-amino-6-(1- (3,5- dimethoxyphenyl)-6- oxo-1,6- dihydropyridazin-3- yl)pyrazin-2-yl)-1H- pyrazol-1- yl)methyl)cyclopropane- 1-carbonitrile::US10208024, Example 4::US10766881, Example 4
SMILES COc1cc(OC)cc(c1)-n1nc(ccc1=O)-c1nc(cnc1N)-c1cnn(CC2(CC2)C#N)c1
InChI Key InChIKey=BTGLYCHFNHKNDV-UHFFFAOYSA-N
Data  6 IC50
  Tab Delimited (TSV)   2D SDfile   Computed 3D by Vconf -m prep SDfile
Find this compound or compounds like it in BindingDB:
Activity Spreadsheet -- Enzyme Inhibition Constant Data from BindingDB
Found 6 hits for monomerid = 350005
TargetFibroblast growth factor receptor 1(Homo sapiens (Human))
Array Biopharma
US Patent
LigandPNGBDBM350005(1-((4-(5-amino-6-(1- (3,5- dimethoxyphenyl)-6- oxo...)
Affinity DataIC50:  15.4nM. Assay description: FGFR1, 2 and 3 kinase activity was measured by the Invitrogen LanthaScreen™ Assay technology which directly measures the amount of substrate phosphor...
Ligand InfoPC cidPC sid
In DepthDetails US Patent
TargetFibroblast growth factor receptor 2(Homo sapiens (Human))
Array Biopharma
US Patent
LigandPNGBDBM350005(1-((4-(5-amino-6-(1- (3,5- dimethoxyphenyl)-6- oxo...)
Affinity DataIC50:  2.80nM. Assay description: FGFR1, 2 and 3 kinase activity was measured by the Invitrogen LanthaScreen™ Assay technology which directly measures the amount of substrate phosphor...
Ligand InfoPC cidPC sid
In DepthDetails US Patent
TargetFibroblast growth factor receptor 3 [397-806](Homo sapiens (Human))
Array Biopharma
US Patent
LigandPNGBDBM350005(1-((4-(5-amino-6-(1- (3,5- dimethoxyphenyl)-6- oxo...)
Affinity DataIC50:  2.40nM
Ligand InfoPC cidPC sid
In DepthDetails US Patent
TargetFibroblast growth factor receptor 1 [308-731](Homo sapiens (Human))
Array Biopharma
US Patent
LigandPNGBDBM350005(1-((4-(5-amino-6-(1- (3,5- dimethoxyphenyl)-6- oxo...)
Affinity DataIC50:  15.4nM. Assay description: To measure FGFR1 kinase activity, 200 pM His-tagged recombinant human FGFR1 catalytic domain (amino acids 308-731) (Life Technologies Cat. No. PR4660...
Ligand InfoPC cidPC sid
In DepthDetails US Patent
TargetFibroblast growth factor receptor 2 [403-822](Homo sapiens (Human))
Array Biopharma
US Patent
LigandPNGBDBM350005(1-((4-(5-amino-6-(1- (3,5- dimethoxyphenyl)-6- oxo...)
Affinity DataIC50:  2.80nM
Ligand InfoPC cidPC sid
In DepthDetails US Patent
TargetFibroblast growth factor receptor 3(Homo sapiens (Human))
Array Biopharma
US Patent
LigandPNGBDBM350005(1-((4-(5-amino-6-(1- (3,5- dimethoxyphenyl)-6- oxo...)
Affinity DataIC50:  2.40nM. Assay description: FGFR1, 2 and 3 kinase activity was measured by the Invitrogen LanthaScreen™ Assay technology which directly measures the amount of substrate phosphor...
Ligand InfoPC cidPC sid
In DepthDetails US Patent