BDBM350035 US10208024, Example 34::US10766881, Example 34
SMILES COc1cc(OC)cc(c1)-n1nc(ccc1=O)-c1nc(cnc1N)-c1cnn(c1)C1CCN(CCOC(F)(F)F)CC1
InChI Key InChIKey=COMXNOYVEFLSSH-UHFFFAOYSA-N
Data  6 IC50
  Tab Delimited (TSV)   2D SDfile   Computed 3D by Vconf -m prep SDfile
Find this compound or compounds like it in BindingDB:
Activity Spreadsheet -- Enzyme Inhibition Constant Data from BindingDB
Found 6 hits for monomerid = 350035
TargetFibroblast growth factor receptor 1(Homo sapiens (Human))
Array Biopharma
US Patent
LigandPNGBDBM350035(US10208024, Example 34 | US10766881, Example 34)
Affinity DataIC50:  38.4nM. Assay description: FGFR1, 2 and 3 kinase activity was measured by the Invitrogen LanthaScreen™ Assay technology which directly measures the amount of substrate phosphor...
Ligand InfoPC cidPC sid
In DepthDetails US Patent
TargetFibroblast growth factor receptor 2(Homo sapiens (Human))
Array Biopharma
US Patent
LigandPNGBDBM350035(US10208024, Example 34 | US10766881, Example 34)
Affinity DataIC50:  3.70nM. Assay description: FGFR1, 2 and 3 kinase activity was measured by the Invitrogen LanthaScreen™ Assay technology which directly measures the amount of substrate phosphor...
Ligand InfoPC cidPC sid
In DepthDetails US Patent
TargetFibroblast growth factor receptor 3 [397-806](Homo sapiens (Human))
Array Biopharma
US Patent
LigandPNGBDBM350035(US10208024, Example 34 | US10766881, Example 34)
Affinity DataIC50:  13.4nM
Ligand InfoPC cidPC sid
In DepthDetails US Patent
TargetFibroblast growth factor receptor 1 [308-731](Homo sapiens (Human))
Array Biopharma
US Patent
LigandPNGBDBM350035(US10208024, Example 34 | US10766881, Example 34)
Affinity DataIC50:  38.4nM. Assay description: To measure FGFR1 kinase activity, 200 pM His-tagged recombinant human FGFR1 catalytic domain (amino acids 308-731) (Life Technologies Cat. No. PR4660...
Ligand InfoPC cidPC sid
In DepthDetails US Patent
TargetFibroblast growth factor receptor 2 [403-822](Homo sapiens (Human))
Array Biopharma
US Patent
LigandPNGBDBM350035(US10208024, Example 34 | US10766881, Example 34)
Affinity DataIC50:  3.70nM
Ligand InfoPC cidPC sid
In DepthDetails US Patent
TargetFibroblast growth factor receptor 3(Homo sapiens (Human))
Array Biopharma
US Patent
LigandPNGBDBM350035(US10208024, Example 34 | US10766881, Example 34)
Affinity DataIC50:  13.4nM. Assay description: FGFR1, 2 and 3 kinase activity was measured by the Invitrogen LanthaScreen™ Assay technology which directly measures the amount of substrate phosphor...
Ligand InfoPC cidPC sid
In DepthDetails US Patent