BDBM35005 benzothienopyrimidinone deriv., 8
SMILES CN(C)Cc1nc2c3cc(Br)ccc3sc2c(=O)[nH]1
InChI Key InChIKey=NNXJGFIMOCXDNA-UHFFFAOYSA-N
Data  2 KI
  Tab Delimited (TSV)   2D SDfile   Computed 3D by Vconf -m prep SDfile
Find this compound or compounds like it in BindingDB:
Activity Spreadsheet -- Enzyme Inhibition Constant Data from BindingDB
Found 2 hits for monomerid = 35005
TargetSerine/threonine-protein kinase pim-1(Homo sapiens (Human))
Abbott Laboratories
LigandPNGBDBM35005(benzothienopyrimidinone deriv., 8)
Affinity DataKi:  5nM ΔG°:  -11.2kcal/molepH: 7.5 T: 2°C. Assay description: In 384-well v-bottom polypropylene plates, compound (2% DMSO) was mixed with Pim kinase and peptide substrate, followed by immediate initiation with ...
In DepthDetails ArticlePubMed
TargetSerine/threonine-protein kinase pim-2(Homo sapiens (Human))
Abbott Laboratories
LigandPNGBDBM35005(benzothienopyrimidinone deriv., 8)
Affinity DataKi:  16nM ΔG°:  -10.6kcal/moleT: 2°C. Assay description: In 384-well v-bottom polypropylene plates, compound (2% DMSO) was mixed with Pim kinase and peptide substrate, followed by immediate initiation with ...
In DepthDetails ArticlePubMed