BDBM350117 2,3-dichloro-N-(6- fluorobenzo[d]thiazol-2- yl)benzenesulfonamide::US10208043, # 18::US10941146, # 18
SMILES Fc1ccc2nc(NS(=O)(=O)c3cccc(Cl)c3Cl)sc2c1
InChI Key InChIKey=ITZWEIPKLJELHO-UHFFFAOYSA-N
Data  2 IC50
  Tab Delimited (TSV)   2D SDfile   Computed 3D by Vconf -m prep SDfile
Find this compound or compounds like it in BindingDB:
Activity Spreadsheet -- Enzyme Inhibition Constant Data from BindingDB
Found 2 hits for monomerid = 350117
TargetFascin(Homo sapiens (human))
Novita Pharmaceuticals
US Patent
LigandPNGBDBM350117(2,3-dichloro-N-(6- fluorobenzo[d]thiazol-2- yl)ben...)
Affinity DataIC50:  1.30E+4nM. Assay description: A high throughput assay was developed to screen for fascin specific inhibitors. Purified polymerized F-actin with or without fascin were mixed and in...
In DepthDetails US Patent
TargetFascin(Homo sapiens (human))
Novita Pharmaceuticals
US Patent
LigandPNGBDBM350117(2,3-dichloro-N-(6- fluorobenzo[d]thiazol-2- yl)ben...)
Affinity DataIC50:  1.30E+4nM. Assay description: About 150,000 compounds were screened. These chemical compounds were from the LOPAC 1280 collection, the Prestwick chemical library, the Pharmakon co...
In DepthDetails US Patent