BDBM350149 (1R,3S)-3-[8-amino-1-(4- {(1R)-1-hydroxy-1-[3- (trifluoromethyl)phenyl] ethyl}phenyl)imidazo[1,5- a]pyrazin-3-yl]-1,3- dimethylcyclopentane- carboxylic acid::US10208047, Example 17
SMILES C[C@@](O)(c1ccc(cc1)-c1nc(n2ccnc(N)c12)[C@@]1(C)CC[C@](C)(C1)C(O)=O)c1cccc(c1)C(F)(F)F
InChI Key InChIKey=LDFYSYVGVWLYSC-UPRLRBBYSA-N
Data  1 IC50
  Tab Delimited (TSV)   2D SDfile   Computed 3D by Vconf -m prep SDfile
Find this compound or compounds like it in BindingDB:
Activity Spreadsheet -- Enzyme Inhibition Constant Data from BindingDB
Found 1 hit for monomerid = 350149
TargetTyrosine-protein kinase BTK(Homo sapiens (Human))
Merck Sharp & Dohme
US Patent
LigandPNGBDBM350149((1R,3S)-3-[8-amino-1-(4- {(1R)-1-hydroxy-1-[3- (tr...)
Affinity DataIC50:  55.1nM. Assay description: BTK enzymatic activity was determined with the LANCE (Lanthanide Chelate Excite) TR-FRET (Time-resolved fluorescence resonance energy transfer) assay...
Ligand InfoPC cidPC sid
In DepthDetails US Patent