BDBM350156 (1S,3R)-3-[8-amino-5- fluoro-1-(4-{(1R)-1- hydroxy-1-[3- (trifluoromethyl)phenyl] ethyl}phenyl)imidazo[1,5- a]pyrazin-3-yl]-1,2,2- trimethylcyclopentane- carboxylic acid::US10208047, Example 24
SMILES C[C@@](O)(c1ccc(cc1)-c1nc([C@@H]2CC[C@](C)(C(O)=O)C2(C)C)n2c(F)cnc(N)c12)c1cccc(c1)C(F)(F)F
InChI Key InChIKey=WCECPYGZQSETOH-XYQOHPTNSA-N
Data  1 IC50
  Tab Delimited (TSV)   2D SDfile   Computed 3D by Vconf -m prep SDfile
Find this compound or compounds like it in BindingDB:
Activity Spreadsheet -- Enzyme Inhibition Constant Data from BindingDB
Found 1 hit for monomerid = 350156
TargetTyrosine-protein kinase BTK(Homo sapiens (Human))
Merck Sharp & Dohme
US Patent
LigandPNGBDBM350156((1S,3R)-3-[8-amino-5- fluoro-1-(4-{(1R)-1- hydroxy...)
Affinity DataIC50:  6.30nM. Assay description: BTK enzymatic activity was determined with the LANCE (Lanthanide Chelate Excite) TR-FRET (Time-resolved fluorescence resonance energy transfer) assay...
Ligand InfoPC cidPC sid
In DepthDetails US Patent