BDBM350170 US10208056, Compound 2
SMILES CC1(C)Oc2cnccc2-c2[nH]c(cc12)C(O)=O
InChI Key InChIKey=BBKBILBUEYTDFO-UHFFFAOYSA-N
Data  2 IC50
  Tab Delimited (TSV)   2D SDfile   Computed 3D by Vconf -m prep SDfile
Find this compound or compounds like it in BindingDB:
Activity Spreadsheet -- Enzyme Inhibition Constant Data from BindingDB
Found 2 hits for monomerid = 350170
TargetSerine/threonine-protein kinase haspin(Homo sapiens (Human))
F.S.P. Cnio
US Patent
LigandPNGBDBM350170(US10208056, Compound 2)
Affinity DataIC50:  306nM. Assay description: The kinase assay relies on ADP-GloKM biochemical kinase assay (Promega). This is a luminescent kinase assay that measures ADP formed from a kinase re...
Ligand InfoPC cidPC sid
In DepthDetails US Patent
TargetCyclin-C/Cyclin-dependent kinase 8(Homo sapiens (Human))
F.S.P. Cnio
US Patent
LigandPNGBDBM350170(US10208056, Compound 2)
Affinity DataIC50:  146nM. Assay description: The binding assay relies on the LanthaScreen™ Eu-Kinase Binding Assay (Invitrogen. This is a kinase assay platform based on measuring the binding and...
Ligand InfoPC cidPC sid
In DepthDetails US Patent