BDBM350415 (S)-4-((1-(3-chloro-6-phenylimidazo[1,2-b]pyridazin-7-yl)ethyl)amino)-6-(methylamino)pyrimidine-5-carbonitrile::US10208066, Compound 33
SMILES CNc1ncnc(N[C@@H](C)c2cc3ncc(Cl)n3nc2-c2ccccc2)c1C#N
InChI Key InChIKey=MXVRTARFIVLPSQ-LBPRGKRZSA-N
Data  1 IC50
  Tab Delimited (TSV)   2D SDfile   Computed 3D by Vconf -m prep SDfile
Find this compound or compounds like it in BindingDB:
Activity Spreadsheet -- Enzyme Inhibition Constant Data from BindingDB
Found 1 hit for monomerid = 350415
TargetPhosphatidylinositol 4,5-bisphosphate 3-kinase catalytic subunit delta isoform(Homo sapiens (Human))
Hutchison Medipharma
US Patent
LigandPNGBDBM350415((S)-4-((1-(3-chloro-6-phenylimidazo[1,2-b]pyridazi...)
Affinity DataIC50:  288nM. Assay description: Briefly, the Transcreener KINASE Assay was designed as a simple two-part, endpoint assay as follows:1) Preparation of 25 uL kinase reaction: the 25 u...
Ligand InfoPC cidPC sid
In DepthDetails US Patent